Reaction Details
TargetDelta-type opioid receptor
LigandBDBM50092682
Substrate/Competitorn/a
Meas. Tech.ChEMBL_145322 (CHEMBL750410)
IC50 555±n/a nM
Citation Plobeck, NDelorme, DWei, ZYYang, HZhou, FSchwarz, PGawell, LGagnon, HPelcman, BSchmidt, RYue, SYWalpole, CBrown, WZhou, ELabarre, MPayza, KSt-Onge, SKamassah, AMorin, PEProjean, DDucharme, JRoberts, E New diarylmethylpiperazines as potent and selective nonpeptidic delta opioid receptor agonists with increased In vitro metabolic stability. J Med Chem43:3878-94 (2000) Delta-type opioid receptor
Name:Delta-type opioid receptor
Type:G Protein-Coupled Receptor (GPCR)
Mol. Mass.:40382.98
Organism:Homo sapiens (Human)
Description:Competition binding assays were carried out using membrane preparations from transfected HN9.10 cells that constitutively expressed the delta opioid receptor.
Residue:372
BDBM50092682
NameBDBM50092682
Synonyms:CHEMBL127346 | Diethyl-[4-(phenyl-piperazin-1-yl-methyl)-benzyl]-amine
TypeSmall organic molecule
Emp. Form.C22H31N3
Mol. Mass.337.5016
SMILESCCN(CC)Cc1ccc(cc1)C(N1CCNCC1)c1ccccc1