Reaction Details
TargetDelta-type opioid receptor
LigandBDBM50092674
Substrate/Competitorn/a
Meas. Tech.ChEMBL_145322 (CHEMBL750410)
IC50 250±n/a nM
Citation Plobeck, NDelorme, DWei, ZYYang, HZhou, FSchwarz, PGawell, LGagnon, HPelcman, BSchmidt, RYue, SYWalpole, CBrown, WZhou, ELabarre, MPayza, KSt-Onge, SKamassah, AMorin, PEProjean, DDucharme, JRoberts, E New diarylmethylpiperazines as potent and selective nonpeptidic delta opioid receptor agonists with increased In vitro metabolic stability. J Med Chem43:3878-94 (2000) Delta-type opioid receptor
Name:Delta-type opioid receptor
Type:G Protein-Coupled Receptor (GPCR)
Mol. Mass.:40382.98
Organism:Homo sapiens (Human)
Description:Competition binding assays were carried out using membrane preparations from transfected HN9.10 cells that constitutively expressed the delta opioid receptor.
Residue:372
BDBM50092674
NameBDBM50092674
Synonyms:1-{Phenyl-[4-(1H-tetrazol-5-yl)-phenyl]-methyl}-piperazine | CHEMBL338772
TypeSmall organic molecule
Emp. Form.C18H20N6
Mol. Mass.320.3916
SMILESC1CN(CCN1)C(c1ccccc1)c1ccc(cc1)-c1nnn[nH]1