Reaction Details
TargetMu-type opioid receptor
LigandBDBM50092664
Substrate/Competitorn/a
Meas. Tech.ChEMBL_145601 (CHEMBL749744)
IC50 1016±n/a nM
Citation Plobeck, NDelorme, DWei, ZYYang, HZhou, FSchwarz, PGawell, LGagnon, HPelcman, BSchmidt, RYue, SYWalpole, CBrown, WZhou, ELabarre, MPayza, KSt-Onge, SKamassah, AMorin, PEProjean, DDucharme, JRoberts, E New diarylmethylpiperazines as potent and selective nonpeptidic delta opioid receptor agonists with increased In vitro metabolic stability. J Med Chem43:3878-94 (2000) Mu-type opioid receptor
Name:Mu-type opioid receptor
Type:G Protein-Coupled Receptor (GPCR)
Mol. Mass.:44789.51
Organism:Homo sapiens (Human)
Description:P35372
Residue:400
BDBM50092664
NameBDBM50092664
Synonyms:CHEMBL126819 | N,N-Diethyl-4-(piperazin-1-yl-quinolin-7-yl-methyl)-benzamide
TypeSmall organic molecule
Emp. Form.C25H30N4O
Mol. Mass.402.5319
SMILESCCN(CC)C(=O)c1ccc(cc1)C(N1CCNCC1)c1ccc2cccnc2c1