Reaction Details
TargetKappa-type opioid receptor
LigandBDBM50092661
Substrate/Competitorn/a
Meas. Tech.ChEMBL_145104 (CHEMBL751988)
IC50>10000±n/a nM
Citation Plobeck, NDelorme, DWei, ZYYang, HZhou, FSchwarz, PGawell, LGagnon, HPelcman, BSchmidt, RYue, SYWalpole, CBrown, WZhou, ELabarre, MPayza, KSt-Onge, SKamassah, AMorin, PEProjean, DDucharme, JRoberts, E New diarylmethylpiperazines as potent and selective nonpeptidic delta opioid receptor agonists with increased In vitro metabolic stability. J Med Chem43:3878-94 (2000) Kappa-type opioid receptor
Name:Kappa-type opioid receptor
Type:G Protein-Coupled Receptor (GPCR)
Mol. Mass.:42648.76
Organism:Homo sapiens (Human)
Description:P41145
Residue:380
BDBM50092661
NameBDBM50092661
Synonyms:CHEMBL127638 | N,N-Diethyl-4-[(4-methoxy-phenyl)-piperazin-1-yl-methyl]-benzamide
TypeSmall organic molecule
Emp. Form.C23H31N3O2
Mol. Mass.381.5111
SMILESCCN(CC)C(=O)c1ccc(cc1)C(N1CCNCC1)c1ccc(OC)cc1