Reaction Details
TargetDelta-type opioid receptor
LigandBDBM50092704
Substrate/Competitorn/a
Meas. Tech.ChEMBL_145312 (CHEMBL751918)
EC50 3.2±n/a nM
Citation Wei, ZYBrown, WTakasaki, BPlobeck, NDelorme, DZhou, FYang, HJones, PGawell, LGagnon, HSchmidt, RYue, SYWalpole, CPayza, KSt-Onge, SLabarre, MGodbout, CJakob, AButterworth, JKamassah, AMorin, PEProjean, DDucharme, JRoberts, E N,N-Diethyl-4-(phenylpiperidin-4-ylidenemethyl)benzamide: a novel, exceptionally selective, potent delta opioid receptor agonist with oral bioavailability and its analogues. J Med Chem43:3895-905 (2000) Delta-type opioid receptor
Name:Delta-type opioid receptor
Type:G Protein-Coupled Receptor (GPCR)
Mol. Mass.:40382.98
Organism:Homo sapiens (Human)
Description:Competition binding assays were carried out using membrane preparations from transfected HN9.10 cells that constitutively expressed the delta opioid receptor.
Residue:372
BDBM50092704
NameBDBM50092704
Synonyms:CHEMBL339898 | N,N-Diethyl-4-[piperidin-4-ylidene-(3-trifluoromethyl-phenyl)-methyl]-benzamide
TypeSmall organic molecule
Emp. Form.C24H27F3N2O
Mol. Mass.416.4792
SMILES[#6]-[#6]-[#7](-[#6]-[#6])-[#6](=O)-c1ccc(cc1)-[#6](=[#6]-1\[#6]-[#6]-[#7]-[#6]-[#6]-1)\c1cccc(c1)C(F)(F)F