Reaction Details
TargetDelta-type opioid receptor
LigandBDBM50092715
Substrate/Competitorn/a
Meas. Tech.ChEMBL_145312 (CHEMBL751918)
EC50 12±n/a nM
Citation Wei, ZYBrown, WTakasaki, BPlobeck, NDelorme, DZhou, FYang, HJones, PGawell, LGagnon, HSchmidt, RYue, SYWalpole, CPayza, KSt-Onge, SLabarre, MGodbout, CJakob, AButterworth, JKamassah, AMorin, PEProjean, DDucharme, JRoberts, E N,N-Diethyl-4-(phenylpiperidin-4-ylidenemethyl)benzamide: a novel, exceptionally selective, potent delta opioid receptor agonist with oral bioavailability and its analogues. J Med Chem43:3895-905 (2000) Delta-type opioid receptor
Name:Delta-type opioid receptor
Type:G Protein-Coupled Receptor (GPCR)
Mol. Mass.:40382.98
Organism:Homo sapiens (Human)
Description:Competition binding assays were carried out using membrane preparations from transfected HN9.10 cells that constitutively expressed the delta opioid receptor.
Residue:372
BDBM50092715
NameBDBM50092715
Synonyms:CHEMBL339922 | N,N-Diethyl-4-[(4-methoxy-phenyl)-piperidin-4-ylidene-methyl]-benzamide
TypeSmall organic molecule
Emp. Form.C24H30N2O2
Mol. Mass.378.5072
SMILES[#6]-[#6]-[#7](-[#6]-[#6])-[#6](=O)-c1ccc(cc1)-[#6](=[#6]-1/[#6]-[#6]-[#7]-[#6]-[#6]-1)\c1ccc(-[#8]-[#6])cc1