Reaction Details
TargetMu-type opioid receptor
LigandBDBM50092718
Substrate/Competitorn/a
Meas. Tech.ChEMBL_145606 (CHEMBL749749)
IC50 4130±n/a nM
Citation Wei, ZYBrown, WTakasaki, BPlobeck, NDelorme, DZhou, FYang, HJones, PGawell, LGagnon, HSchmidt, RYue, SYWalpole, CPayza, KSt-Onge, SLabarre, MGodbout, CJakob, AButterworth, JKamassah, AMorin, PEProjean, DDucharme, JRoberts, E N,N-Diethyl-4-(phenylpiperidin-4-ylidenemethyl)benzamide: a novel, exceptionally selective, potent delta opioid receptor agonist with oral bioavailability and its analogues. J Med Chem43:3895-905 (2000) Mu-type opioid receptor
Name:Mu-type opioid receptor
Type:G Protein-Coupled Receptor (GPCR)
Mol. Mass.:44789.51
Organism:Homo sapiens (Human)
Description:P35372
Residue:400
BDBM50092718
NameBDBM50092718
Synonyms:4-[(1-Butyl-piperidin-4-ylidene)-phenyl-methyl]-N,N-diethyl-benzamide | CHEMBL127802
TypeSmall organic molecule
Emp. Form.C27H36N2O
Mol. Mass.404.5875
SMILES[#6]-[#6]-[#6]-[#6]-[#7]-1-[#6]-[#6]\[#6](-[#6]-[#6]-1)=[#6](\c1ccccc1)-c1ccc(cc1)-[#6](=O)-[#7](-[#6]-[#6])-[#6]-[#6]