Reaction Details
TargetMu-type opioid receptor
LigandBDBM50092717
Substrate/Competitorn/a
Meas. Tech.ChEMBL_145606 (CHEMBL749749)
IC50 817±n/a nM
Citation Wei, ZYBrown, WTakasaki, BPlobeck, NDelorme, DZhou, FYang, HJones, PGawell, LGagnon, HSchmidt, RYue, SYWalpole, CPayza, KSt-Onge, SLabarre, MGodbout, CJakob, AButterworth, JKamassah, AMorin, PEProjean, DDucharme, JRoberts, E N,N-Diethyl-4-(phenylpiperidin-4-ylidenemethyl)benzamide: a novel, exceptionally selective, potent delta opioid receptor agonist with oral bioavailability and its analogues. J Med Chem43:3895-905 (2000) Mu-type opioid receptor
Name:Mu-type opioid receptor
Type:G Protein-Coupled Receptor (GPCR)
Mol. Mass.:44789.51
Organism:Homo sapiens (Human)
Description:P35372
Residue:400
BDBM50092717
NameBDBM50092717
Synonyms:CHEMBL129034 | N,N-Diethyl-4-(naphthalen-1-yl-piperidin-4-ylidene-methyl)-benzamide
TypeSmall organic molecule
Emp. Form.C27H30N2O
Mol. Mass.398.5399
SMILES[#6]-[#6]-[#7](-[#6]-[#6])-[#6](=O)-c1ccc(cc1)-[#6](=[#6]-1\[#6]-[#6]-[#7]-[#6]-[#6]-1)\c1cccc2ccccc12