Reaction Details
TargetB2 bradykinin receptor
LigandBDBM50093761
Substrate/Competitorn/a
Meas. Tech.ChEBML_40297
Kd 28000±n/a nM
Citation Artis, DRBrotherton-Pleiss, CPease, JHLin, CJFerla, SWNewman, SRBhakta, SOstrelich, HJarnagin, K Structure-based design of six novel classes of nonpeptide antagonists of the bradykinin B2 receptor. Bioorg Med Chem Lett10:2421-5 (2001) B2 bradykinin receptor
Name:B2 bradykinin receptor
Type:Enzyme Catalytic Domain
Mol. Mass.:44467.17
Organism:Homo sapiens (Human)
Description:B2 BRADYKININ BDKRB2 HUMAN::P30411
Residue:391
BDBM50093761
NameBDBM50093761
Synonyms:1-[(R)-5-Amino-1-(4-aminomethyl-benzylcarbamoyl)-pentyl]-1H-pyrrole-2-carboxylic acid (1,2-diphenyl-ethyl)-amide | CHEMBL312374
TypeSmall organic molecule
Emp. Form.C33H39N5O2
Mol. Mass.537.6951
SMILESNCCCC[C@H](C(=O)NCc1ccc(CN)cc1)n1cccc1C(=O)NC(Cc1ccccc1)c1ccccc1