Reaction Details
TargetB2 bradykinin receptor
LigandBDBM50093759
Substrate/Competitorn/a
Meas. Tech.ChEBML_40297
Kd 17000±n/a nM
Citation Artis, DRBrotherton-Pleiss, CPease, JHLin, CJFerla, SWNewman, SRBhakta, SOstrelich, HJarnagin, K Structure-based design of six novel classes of nonpeptide antagonists of the bradykinin B2 receptor. Bioorg Med Chem Lett10:2421-5 (2001) B2 bradykinin receptor
Name:B2 bradykinin receptor
Type:Enzyme Catalytic Domain
Mol. Mass.:44467.17
Organism:Homo sapiens (Human)
Description:B2 BRADYKININ BDKRB2 HUMAN::P30411
Residue:391
BDBM50093759
NameBDBM50093759
Synonyms:(R)-3-Amino-N-(4-aminomethyl-benzyl)-2-{2-[(2-cyclohexyl-2-phenyl-acetylamino)-methyl]-pyrrol-1-yl}-propionamide | CHEMBL311420
TypeSmall organic molecule
Emp. Form.C30H39N5O2
Mol. Mass.501.663
SMILESNC[C@H](C(=O)NCc1ccc(CN)cc1)n1cccc1CNC(=O)C(C1CCCCC1)c1ccccc1