Reaction Details
TargetB2 bradykinin receptor
LigandBDBM50093762
Substrate/Competitorn/a
Meas. Tech.ChEBML_40297
Kd 4300±n/a nM
Citation Artis, DRBrotherton-Pleiss, CPease, JHLin, CJFerla, SWNewman, SRBhakta, SOstrelich, HJarnagin, K Structure-based design of six novel classes of nonpeptide antagonists of the bradykinin B2 receptor. Bioorg Med Chem Lett10:2421-5 (2001) B2 bradykinin receptor
Name:B2 bradykinin receptor
Type:Enzyme Catalytic Domain
Mol. Mass.:44467.17
Organism:Homo sapiens (Human)
Description:B2 BRADYKININ BDKRB2 HUMAN::P30411
Residue:391
BDBM50093762
NameBDBM50093762
Synonyms:3-Aminomethyl-1-(3-amino-propyl)-7-dibenzylamino-5-phenyl-1,3-dihydro-benzo[e][1,4]diazepin-2-one | CHEMBL310300
TypeSmall organic molecule
Emp. Form.C33H35N5O
Mol. Mass.517.6639
SMILESNCCCN1c2ccc(cc2C(=NC(CN)C1=O)c1ccccc1)N(Cc1ccccc1)Cc1ccccc1