Reaction Details
TargetB2 bradykinin receptor
LigandBDBM50093763
Substrate/Competitorn/a
Meas. Tech.ChEBML_40297
Kd 4500±n/a nM
Citation Artis, DRBrotherton-Pleiss, CPease, JHLin, CJFerla, SWNewman, SRBhakta, SOstrelich, HJarnagin, K Structure-based design of six novel classes of nonpeptide antagonists of the bradykinin B2 receptor. Bioorg Med Chem Lett10:2421-5 (2001) B2 bradykinin receptor
Name:B2 bradykinin receptor
Type:Enzyme Catalytic Domain
Mol. Mass.:44467.17
Organism:Homo sapiens (Human)
Description:B2 BRADYKININ BDKRB2 HUMAN::P30411
Residue:391
BDBM50093763
NameBDBM50093763
Synonyms:CHEMBL311969 | N-{3-[7-Dibenzylamino-3-(2-guanidino-ethyl)-2-oxo-5-phenyl-2,3-dihydro-benzo[e][1,4]diazepin-1-yl]-propyl}-guanidine
TypeSmall organic molecule
Emp. Form.C36H41N9O
Mol. Mass.615.7704
SMILESNC(=N)NCCCN1c2ccc(cc2C(=NC(CCNC(N)=N)C1=O)c1ccccc1)N(Cc1ccccc1)Cc1ccccc1