Reaction Details
TargetB2 bradykinin receptor
LigandBDBM50093768
Substrate/Competitorn/a
Meas. Tech.ChEBML_40297
Kd 23000±n/a nM
Citation Artis, DRBrotherton-Pleiss, CPease, JHLin, CJFerla, SWNewman, SRBhakta, SOstrelich, HJarnagin, K Structure-based design of six novel classes of nonpeptide antagonists of the bradykinin B2 receptor. Bioorg Med Chem Lett10:2421-5 (2001) B2 bradykinin receptor
Name:B2 bradykinin receptor
Type:Enzyme Catalytic Domain
Mol. Mass.:44467.17
Organism:Homo sapiens (Human)
Description:B2 BRADYKININ BDKRB2 HUMAN::P30411
Residue:391
BDBM50093768
NameBDBM50093768
Synonyms:5-Dibutylamino-pentanoic acid [(S)-1-(4-butyl-pyridin-2-yl)-2-cyclohexyl-ethyl]-amide | CHEMBL82249
TypeSmall organic molecule
Emp. Form.C30H53N3O
Mol. Mass.471.7613
SMILESCCCCN(CCCC)CCCCC(=O)N[C@@H](CC1CCCCC1)c1cc(CCCC)ccn1