Reaction Details
TargetB2 bradykinin receptor
LigandBDBM50218386
Substrate/Competitorn/a
Meas. Tech.ChEMBL_40419 (CHEMBL652634)
Kd 200±n/a nM
Citation Artis, DRBrotherton-Pleiss, CPease, JHLin, CJFerla, SWNewman, SRBhakta, SOstrelich, HJarnagin, K Structure-based design of six novel classes of nonpeptide antagonists of the bradykinin B2 receptor. Bioorg Med Chem Lett10:2421-5 (2001) B2 bradykinin receptor
Name:B2 bradykinin receptor
Type:Enzyme Catalytic Domain
Mol. Mass.:44467.17
Organism:Homo sapiens (Human)
Description:B2 BRADYKININ BDKRB2 HUMAN::P30411
Residue:391
BDBM50218386
NameBDBM50218386
Synonyms:CHEMBL3142416
TypeSmall organic molecule
Emp. Form.C41H55N9O6
Mol. Mass.769.9321
SMILESNC(=N)NCCC[C@@H]1NC(=O)N2C3CCCCC3C[C@H]2C(=O)N2Cc3ccccc3C[C@@H]2C(=O)NCC[C@@H](NC(=O)CCc2ccccc2)C(=O)CCNC1=O