Reaction Details
TargetB2 bradykinin receptor
LigandBDBM50093770
Substrate/Competitorn/a
Meas. Tech.ChEBML_40297
Kd 7400±n/a nM
Citation Artis, DRBrotherton-Pleiss, CPease, JHLin, CJFerla, SWNewman, SRBhakta, SOstrelich, HJarnagin, K Structure-based design of six novel classes of nonpeptide antagonists of the bradykinin B2 receptor. Bioorg Med Chem Lett10:2421-5 (2001) B2 bradykinin receptor
Name:B2 bradykinin receptor
Type:Enzyme Catalytic Domain
Mol. Mass.:44467.17
Organism:Homo sapiens (Human)
Description:B2 BRADYKININ BDKRB2 HUMAN::P30411
Residue:391
BDBM50093770
NameBDBM50093770
Synonyms:4-Aminomethyl-N-[(S)-1-(4-butyl-pyridin-2-yl)-2-cyclohexyl-ethyl]-benzamide | CHEMBL311593
TypeSmall organic molecule
Emp. Form.C25H35N3O
Mol. Mass.393.5649
SMILESCCCCc1ccnc(c1)[C@H](CC1CCCCC1)NC(=O)c1ccc(CN)cc1