Reaction Details
TargetB2 bradykinin receptor
LigandBDBM50093772
Substrate/Competitorn/a
Meas. Tech.ChEBML_40297
Kd 12000±n/a nM
Citation Artis, DRBrotherton-Pleiss, CPease, JHLin, CJFerla, SWNewman, SRBhakta, SOstrelich, HJarnagin, K Structure-based design of six novel classes of nonpeptide antagonists of the bradykinin B2 receptor. Bioorg Med Chem Lett10:2421-5 (2001) B2 bradykinin receptor
Name:B2 bradykinin receptor
Type:Enzyme Catalytic Domain
Mol. Mass.:44467.17
Organism:Homo sapiens (Human)
Description:B2 BRADYKININ BDKRB2 HUMAN::P30411
Residue:391
BDBM50093772
NameBDBM50093772
Synonyms:CHEMBL311191 | N-[3-(7-Dibenzylamino-3-guanidinomethyl-2-oxo-5-phenyl-2,3-dihydro-benzo[e][1,4]diazepin-1-yl)-propyl]-guanidine
TypeSmall organic molecule
Emp. Form.C35H39N9O
Mol. Mass.601.7439
SMILES[#7]\[#6](-[#7])=[#7]\[#6]-[#6]-1-[#7]=[#6](-c2ccccc2)-c2cc(ccc2-[#7](-[#6]-[#6]-[#6]-[#7]-[#6](-[#7])=[#7])-[#6]-1=O)-[#7](-[#6]-c1ccccc1)-[#6]-c1ccccc1