Reaction Details
TargetB2 bradykinin receptor
LigandBDBM50093773
Substrate/Competitorn/a
Meas. Tech.ChEBML_40297
Kd 15000±n/a nM
Citation Artis, DRBrotherton-Pleiss, CPease, JHLin, CJFerla, SWNewman, SRBhakta, SOstrelich, HJarnagin, K Structure-based design of six novel classes of nonpeptide antagonists of the bradykinin B2 receptor. Bioorg Med Chem Lett10:2421-5 (2001) B2 bradykinin receptor
Name:B2 bradykinin receptor
Type:Enzyme Catalytic Domain
Mol. Mass.:44467.17
Organism:Homo sapiens (Human)
Description:B2 BRADYKININ BDKRB2 HUMAN::P30411
Residue:391
BDBM50093773
NameBDBM50093773
Synonyms:3-(2-Amino-ethyl)-1-(3-amino-propyl)-7-dibenzylamino-5-phenyl-1,3-dihydro-benzo[e][1,4]diazepin-2-one | CHEMBL312658
TypeSmall organic molecule
Emp. Form.C34H37N5O
Mol. Mass.531.6905
SMILESNCCCN1c2ccc(cc2C(=NC(CCN)C1=O)c1ccccc1)N(Cc1ccccc1)Cc1ccccc1