Reaction Details
TargetB2 bradykinin receptor
LigandBDBM50093774
Substrate/Competitorn/a
Meas. Tech.ChEBML_40297
Kd 15000±n/a nM
Citation Artis, DRBrotherton-Pleiss, CPease, JHLin, CJFerla, SWNewman, SRBhakta, SOstrelich, HJarnagin, K Structure-based design of six novel classes of nonpeptide antagonists of the bradykinin B2 receptor. Bioorg Med Chem Lett10:2421-5 (2001) B2 bradykinin receptor
Name:B2 bradykinin receptor
Type:Enzyme Catalytic Domain
Mol. Mass.:44467.17
Organism:Homo sapiens (Human)
Description:B2 BRADYKININ BDKRB2 HUMAN::P30411
Residue:391
BDBM50093774
NameBDBM50093774
Synonyms:CHEMBL310531 | N-[(2R,4R)-4-Benzyloxy-1-(naphthalene-2-carbonyl)-pyrrolidin-2-ylmethyl]-guanidine
TypeSmall organic molecule
Emp. Form.C24H26N4O2
Mol. Mass.402.4888
SMILES[#7]\[#6](-[#7])=[#7]\[#6]-[#6@H]-1-[#6]-[#6@H](-[#6]-[#7]-1-[#6](=O)-c1ccc2ccccc2c1)-[#8]-[#6]-c1ccccc1