Reaction Details
TargetKappa-type opioid receptor
LigandBDBM50093972
Substrate/Competitorn/a
Meas. Tech.ChEBML_145268
Ki 1.1±n/a nM
Citation Kumar, VMarella, MACortes-Burgos, LChang, ACCassel, JADaubert, JDDeHaven, RNDeHaven-Hudkins, DLGottshall, SLMansson, EMaycock, AL Arylacetamides as peripherally restricted kappa opioid receptor agonists. Bioorg Med Chem Lett10:2567-70 (2001) Kappa-type opioid receptor
Name:Kappa-type opioid receptor
Type:G Protein-Coupled Receptor (GPCR)
Mol. Mass.:42648.76
Organism:Homo sapiens (Human)
Description:P41145
Residue:380
BDBM50093972
NameBDBM50093972
Synonyms:CHEMBL87986 | N-Methyl-2-(4-nitro-phenyl)-N-((S)-1-phenyl-2-pyrrolidin-1-yl-ethyl)-acetamide
TypeSmall organic molecule
Emp. Form.C21H25N3O3
Mol. Mass.367.4415
SMILESCN([C@H](CN1CCCC1)c1ccccc1)C(=O)Cc1ccc(cc1)[N+]([O-])=O