Reaction Details
TargetMitogen-activated protein kinase 14
LigandBDBM50095422
Substrate/Competitorn/a
Meas. Tech.ChEBML_124639
IC50 119±n/a nM
Citation Redman, AMJohnson, JSDally, RSwartz, SWild, HPaulsen, HCaringal, YGunn, DRenick, JOsterhout, MKingery-Wood, JSmith, RALee, WDumas, JWilhelm, SMHousley, TJBhargava, ARanges, GEShrikhande, AYoung, DBombara, MScott, WJ p38 kinase inhibitors for the treatment of arthritis and osteoporosis: thienyl, furyl, and pyrrolyl ureas. Bioorg Med Chem Lett11:9-12 (2001) Mitogen-activated protein kinase 14
Name:Mitogen-activated protein kinase 14
Type:Serine/threonine-protein kinase
Mol. Mass.:41286.76
Organism:Homo sapiens (Human)
Description:Q16539
Residue:360
BDBM50095422
NameBDBM50095422
Synonyms:5-tert-Butyl-3-[3-(4-ethyl-phenyl)-ureido]-thiophene-2-carboxylic acid methylamide | CHEMBL18752
TypeSmall organic molecule
Emp. Form.C19H25N3O2S
Mol. Mass.359.486
SMILESCCc1ccc(NC(=O)Nc2cc(sc2C(=O)NC)C(C)(C)C)cc1