Reaction Details
TargetMitogen-activated protein kinase 14
LigandBDBM50095425
Substrate/Competitorn/a
Meas. Tech.ChEBML_124639
IC50 663±n/a nM
Citation Redman, AMJohnson, JSDally, RSwartz, SWild, HPaulsen, HCaringal, YGunn, DRenick, JOsterhout, MKingery-Wood, JSmith, RALee, WDumas, JWilhelm, SMHousley, TJBhargava, ARanges, GEShrikhande, AYoung, DBombara, MScott, WJ p38 kinase inhibitors for the treatment of arthritis and osteoporosis: thienyl, furyl, and pyrrolyl ureas. Bioorg Med Chem Lett11:9-12 (2001) Mitogen-activated protein kinase 14
Name:Mitogen-activated protein kinase 14
Type:Serine/threonine-protein kinase
Mol. Mass.:41286.76
Organism:Homo sapiens (Human)
Description:Q16539
Residue:360
BDBM50095425
NameBDBM50095425
Synonyms:5-tert-Butyl-3-[3-(4-fluoro-phenyl)-ureido]-1-methyl-1H-pyrrole-2-carboxylic acid methyl ester | CHEMBL18709
TypeSmall organic molecule
Emp. Form.C18H22FN3O3
Mol. Mass.347.384
SMILESCOC(=O)c1c(NC(=O)Nc2ccc(F)cc2)cc(n1C)C(C)(C)C