Reaction Details
TargetMitogen-activated protein kinase 14
LigandBDBM50095415
Substrate/Competitorn/a
Meas. Tech.ChEBML_124639
IC50 28±n/a nM
Citation Redman, AMJohnson, JSDally, RSwartz, SWild, HPaulsen, HCaringal, YGunn, DRenick, JOsterhout, MKingery-Wood, JSmith, RALee, WDumas, JWilhelm, SMHousley, TJBhargava, ARanges, GEShrikhande, AYoung, DBombara, MScott, WJ p38 kinase inhibitors for the treatment of arthritis and osteoporosis: thienyl, furyl, and pyrrolyl ureas. Bioorg Med Chem Lett11:9-12 (2001) Mitogen-activated protein kinase 14
Name:Mitogen-activated protein kinase 14
Type:Serine/threonine-protein kinase
Mol. Mass.:41286.76
Organism:Homo sapiens (Human)
Description:Q16539
Residue:360
BDBM50095415
NameBDBM50095415
Synonyms:5-tert-Butyl-3-(3-naphthalen-1-yl-ureido)-1H-pyrrole-2-carboxylic acid methylamide | CHEMBL18103
TypeSmall organic molecule
Emp. Form.C21H24N4O2
Mol. Mass.364.4409
SMILESCNC(=O)c1[nH]c(cc1NC(=O)Nc1cccc2ccccc12)C(C)(C)C