Reaction Details
TargetPapain
LigandBDBM50095489
Substrate/Competitorn/a
Meas. Tech.ChEMBL_222263 (CHEMBL823835)
pH5.5±n/a
IC50 230±n/a nM
Commentsextracted
Citation Falgueyret, JPOballa, RMOkamoto, OWesolowski, GAubin, YRydzewski, RMPrasit, PRiendeau, DRodan, SBPercival, MD Novel, nonpeptidic cyanamides as potent and reversible inhibitors of human cathepsins K and L. J Med Chem44:94-104 (2001) Papain
Name:Papain
Type:Enzyme
Mol. Mass.:38923.01
Organism:Carica papaya
Description:Papain was purchased from Sigma, Germany.
Residue:345
BDBM50095489
NameBDBM50095489
Synonyms:CHEMBL275080 N-(1-cyanopyrrolidin-3-yl)benzenesulfonamide | US11414402, Example 5
TypeSmall organic molecule
Emp. Form.C11H13N3O2S
Mol. Mass.251.305
SMILESO=S(=O)(NC1CCN(C1)C#N)c1ccccc1