Reaction Details
TargetSerine/threonine-protein kinase ATR
LigandBDBM268079
Substrate/Competitorn/a
Meas. Tech.ChEMBL_1979571 (CHEMBL4612706)
IC50 7.0±n/a nM
Citation Lücking, UWortmann, LWengner, AMLefranc, JLienau, PBriem, HSiemeister, GBömer, UDenner, KSchäfer, MKoppitz, MEis, KBartels, FBader, BBone, WMoosmayer, DHolton, SJEberspächer, UGrudzinska-Goebel, JSchatz, CDeeg, GMumberg, Dvon Nussbaum, F Damage Incorporated: Discovery of the Potent, Highly Selective, Orally Available ATR Inhibitor BAY 1895344 with Favorable Pharmacokinetic Properties and Promising Efficacy in Monotherapy and in Combination Treatments in Preclinical Tumor Models. J Med Chem63:7293-7325 (2020) 
 
Serine/threonine-protein kinase ATR
Name:Serine/threonine-protein kinase ATR
Type:Protein
Mol. Mass.:301404.58
Organism:Homo sapiens (Human)
Description:Q13535
Residue:2644
BDBM268079
NameBDBM268079
Synonyms:2-[(3R)-3-methylmorpholin-4-yl]-4-(1-methyl-1H-pyrazol-5-yl)-8-(1H-pyrazol-5-yl)-1,7-naphthyridine US11529356, Example 111 | US9549932, 111
TypeSmall organic molecule
Emp. Form.C20H21N7O
Mol. Mass.375.427
SMILESC[C@@H]1COCCN1c1cc(-c2ccnn2C)c2ccnc(-c3ccn[nH]3)c2n1