Reaction Details
TargetBifunctional glutamate/proline--tRNA ligase
LigandBDBM50097096
Substrate/Competitorn/a
Meas. Tech.ChEMBL_223472 (CHEMBL844882)
Ki 15±n/a nM
Citation Yu, XYHill, JMYu, GYang, YKluge, AFKeith, DFinn, JGallant, PSilverman, JLim, A A series of quinoline analogues as potent inhibitors of C. albicans prolyl tRNA synthetase. Bioorg Med Chem Lett11:541-4 (2001) Bifunctional glutamate/proline--tRNA ligase
Name:Bifunctional glutamate/proline--tRNA ligase
Type:PROTEIN
Mol. Mass.:170602.50
Organism:Homo sapiens (Human)
Description:ChEMBL_223474
Residue:1512
BDBM50097096
NameBDBM50097096
Synonyms:2-(4-Bromo-phenyl)-6-chloro-8-methyl-quinoline-4-carboxylic acid | CHEMBL357355
TypeSmall organic molecule
Emp. Form.C17H11BrClNO2
Mol. Mass.376.632
SMILESCc1cc(Cl)cc2c(cc(nc12)-c1ccc(Br)cc1)C(O)=O