Reaction Details
TargetBifunctional glutamate/proline--tRNA ligase
LigandBDBM50097087
Substrate/Competitorn/a
Meas. Tech.ChEBML_223472
IC50 80000±n/a nM
Citation Yu, XYHill, JMYu, GYang, YKluge, AFKeith, DFinn, JGallant, PSilverman, JLim, A A series of quinoline analogues as potent inhibitors of C. albicans prolyl tRNA synthetase. Bioorg Med Chem Lett11:541-4 (2001) Bifunctional glutamate/proline--tRNA ligase
Name:Bifunctional glutamate/proline--tRNA ligase
Type:PROTEIN
Mol. Mass.:170602.50
Organism:Homo sapiens (Human)
Description:ChEMBL_223474
Residue:1512
BDBM50097087
NameBDBM50097087
Synonyms:2-(4-Bromo-phenyl)-6-((E)-2-carboxy-vinyl)-quinoline-4-carboxylic acid | CHEMBL150306
TypeSmall organic molecule
Emp. Form.C19H12BrNO4
Mol. Mass.398.207
SMILESOC(=O)\C=C\c1ccc2nc(cc(C(O)=O)c2c1)-c1ccc(Br)cc1