Reaction Details
TargetProline--tRNA ligase, cytoplasmic
LigandBDBM50097098
Substrate/Competitorn/a
Meas. Tech.ChEBML_223470
IC50 32000±n/a nM
Citation Yu, XYHill, JMYu, GYang, YKluge, AFKeith, DFinn, JGallant, PSilverman, JLim, A A series of quinoline analogues as potent inhibitors of C. albicans prolyl tRNA synthetase. Bioorg Med Chem Lett11:541-4 (2001) Proline--tRNA ligase, cytoplasmic
Name:Proline--tRNA ligase, cytoplasmic
Type:PROTEIN
Mol. Mass.:66202.25
Organism:Candida albicans
Description:ChEMBL_223470
Residue:575
BDBM50097098
NameBDBM50097098
Synonyms:2-(5-Chloro-thiophen-2-yl)-quinoline-4-carboxylic acid cid_625773
TypeSmall organic molecule
Emp. Form.C14H8ClNO2S
Mol. Mass.289.737
SMILESOC(=O)c1cc(nc2ccccc12)-c1ccc(Cl)s1