Reaction Details
TargetBifunctional glutamate/proline--tRNA ligase
LigandBDBM50097106
Substrate/Competitorn/a
Meas. Tech.ChEBML_223472
IC50>20000±n/a nM
Citation Yu, XYHill, JMYu, GYang, YKluge, AFKeith, DFinn, JGallant, PSilverman, JLim, A A series of quinoline analogues as potent inhibitors of C. albicans prolyl tRNA synthetase. Bioorg Med Chem Lett11:541-4 (2001) Bifunctional glutamate/proline--tRNA ligase
Name:Bifunctional glutamate/proline--tRNA ligase
Type:PROTEIN
Mol. Mass.:170602.50
Organism:Homo sapiens (Human)
Description:ChEMBL_223474
Residue:1512
BDBM50097106
NameBDBM50097106
Synonyms:2-(4-Bromo-phenyl)-8-chloro-6-methyl-quinoline-4-carboxylic acid | CHEMBL150488
TypeSmall organic molecule
Emp. Form.C17H11BrClNO2
Mol. Mass.376.632
SMILESCc1cc(Cl)c2nc(cc(C(O)=O)c2c1)-c1ccc(Br)cc1