Reaction Details
TargetBifunctional glutamate/proline--tRNA ligase
LigandBDBM50097113
Substrate/Competitorn/a
Meas. Tech.ChEBML_223472
IC50>100000±n/a nM
Citation Yu, XYHill, JMYu, GYang, YKluge, AFKeith, DFinn, JGallant, PSilverman, JLim, A A series of quinoline analogues as potent inhibitors of C. albicans prolyl tRNA synthetase. Bioorg Med Chem Lett11:541-4 (2001) Bifunctional glutamate/proline--tRNA ligase
Name:Bifunctional glutamate/proline--tRNA ligase
Type:PROTEIN
Mol. Mass.:170602.50
Organism:Homo sapiens (Human)
Description:ChEMBL_223474
Residue:1512
BDBM50097113
NameBDBM50097113
Synonyms:2-(4-Bromo-phenyl)-6-trifluoromethoxy-quinoline-4-carboxylic acid | CHEMBL153295
TypeSmall organic molecule
Emp. Form.C17H9BrF3NO3
Mol. Mass.412.157
SMILESOC(=O)c1cc(nc2ccc(OC(F)(F)F)cc12)-c1ccc(Br)cc1