Reaction Details
TargetProthrombin
LigandBDBM50097625
Substrate/Competitorn/a
Meas. Tech.ChEBML_208311
Ki 1250±n/a nM
Citation Fevig, JMPinto, DJHan, QQuan, MLPruitt, JRJacobson, ICGalemmo, RAWang, SOrwat, MJBostrom, LLKnabb, RMWong, PCLam PYS, naWexler, RR Synthesis and SAR of benzamidine factor Xa inhibitors containing a vicinally-substituted heterocyclic core. Bioorg Med Chem Lett11:641-5 (2001) Prothrombin
Name:Prothrombin
Type:Protein
Mol. Mass.:70029.57
Organism:Homo sapiens (Human)
Description:P00734
Residue:622
BDBM50097625
NameBDBM50097625
Synonyms:4-(3-Carbamimidoyl-phenyl)-2-methyl-thiazole-5-carboxylic acid (2'-sulfamoyl-biphenyl-4-yl)-amide; TFA | CHEMBL156924
TypeSmall organic molecule
Emp. Form.C24H21N5O3S2
Mol. Mass.491.585
SMILESCc1nc(c(s1)C(=O)Nc1ccc(cc1)-c1ccccc1S(N)(=O)=O)-c1cccc(c1)C(N)=N