Reaction Details
TargetIntercellular adhesion molecule 1
LigandBDBM50098486
Substrate/Competitorn/a
Meas. Tech.ChEMBL_89064 (CHEMBL697203)
IC50 99.0±n/a nM
Citation Stewart, AOBhatia, PAMcCarty, CMPatel, MVStaeger, MAArendsen, DLGunawardana, IWMelcher, LMZhu, GDBoyd, SAFry, DGCool, BLKifle, LLartey, KMarsh, KCKempf-Grote, AJKilgannon, PWisdom, WMeyer, JGallatin, WMOkasinski, GF Discovery of inhibitors of cell adhesion molecule expression in human endothelial cells. 1. Selective inhibition of ICAM-1 and E-selectin expression. J Med Chem44:988-1002 (2001) Intercellular adhesion molecule 1
Name:Intercellular adhesion molecule 1
Type:PROTEIN
Mol. Mass.:57831.10
Organism:Homo sapiens (Human)
Description:ChEMBL_826675
Residue:532
BDBM50098486
NameBDBM50098486
Synonyms:4-p-Tolylsulfanyl-thieno[2,3-c]pyridine-2-carboxylic acid methoxy-methyl-amide | CHEMBL6517
TypeSmall organic molecule
Emp. Form.C17H16N2O2S2
Mol. Mass.344.451
SMILESCON(C)C(=O)c1cc2c(Sc3ccc(C)cc3)cncc2s1