Reaction Details
TargetIntercellular adhesion molecule 1
LigandBDBM50098515
Substrate/Competitorn/a
Meas. Tech.ChEMBL_89064 (CHEMBL697203)
IC50 140±n/a nM
Citation Stewart, AOBhatia, PAMcCarty, CMPatel, MVStaeger, MAArendsen, DLGunawardana, IWMelcher, LMZhu, GDBoyd, SAFry, DGCool, BLKifle, LLartey, KMarsh, KCKempf-Grote, AJKilgannon, PWisdom, WMeyer, JGallatin, WMOkasinski, GF Discovery of inhibitors of cell adhesion molecule expression in human endothelial cells. 1. Selective inhibition of ICAM-1 and E-selectin expression. J Med Chem44:988-1002 (2001) Intercellular adhesion molecule 1
Name:Intercellular adhesion molecule 1
Type:PROTEIN
Mol. Mass.:57831.10
Organism:Homo sapiens (Human)
Description:ChEMBL_826675
Residue:532
BDBM50098515
NameBDBM50098515
Synonyms:4-m-Tolylsulfanyl-thieno[2,3-c]pyridine-2-carboxylic acid amide | CHEMBL269497
TypeSmall organic molecule
Emp. Form.C15H12N2OS2
Mol. Mass.300.399
SMILESCc1cccc(Sc2cncc3sc(cc23)C(N)=O)c1