Reaction Details
TargetIntercellular adhesion molecule 1
LigandBDBM50098499
Substrate/Competitorn/a
Meas. Tech.ChEMBL_89064 (CHEMBL697203)
IC50 85.0±n/a nM
Citation Stewart, AOBhatia, PAMcCarty, CMPatel, MVStaeger, MAArendsen, DLGunawardana, IWMelcher, LMZhu, GDBoyd, SAFry, DGCool, BLKifle, LLartey, KMarsh, KCKempf-Grote, AJKilgannon, PWisdom, WMeyer, JGallatin, WMOkasinski, GF Discovery of inhibitors of cell adhesion molecule expression in human endothelial cells. 1. Selective inhibition of ICAM-1 and E-selectin expression. J Med Chem44:988-1002 (2001) Intercellular adhesion molecule 1
Name:Intercellular adhesion molecule 1
Type:PROTEIN
Mol. Mass.:57831.10
Organism:Homo sapiens (Human)
Description:ChEMBL_826675
Residue:532
BDBM50098499
NameBDBM50098499
Synonyms:1-(4-p-Tolylsulfanyl-thieno[2,3-c]pyridin-2-yl)-ethanone oxime | CHEMBL262570
TypeSmall organic molecule
Emp. Form.C16H14N2OS2
Mol. Mass.314.425
SMILESCC(N=O)c1cc2c(Sc3ccc(C)cc3)cncc2s1