Reaction Details
TargetVascular cell adhesion protein 1
LigandBDBM50098480
Substrate/Competitorn/a
Meas. Tech.ChEMBL_213817 (CHEMBL815900)
IC50>4000±n/a nM
Citation Stewart, AOBhatia, PAMcCarty, CMPatel, MVStaeger, MAArendsen, DLGunawardana, IWMelcher, LMZhu, GDBoyd, SAFry, DGCool, BLKifle, LLartey, KMarsh, KCKempf-Grote, AJKilgannon, PWisdom, WMeyer, JGallatin, WMOkasinski, GF Discovery of inhibitors of cell adhesion molecule expression in human endothelial cells. 1. Selective inhibition of ICAM-1 and E-selectin expression. J Med Chem44:988-1002 (2001) Vascular cell adhesion protein 1
Name:Vascular cell adhesion protein 1
Type:Other Protein Type
Mol. Mass.:81259.16
Organism:Homo sapiens (Human)
Description:P19320
Residue:739
BDBM50098480
NameBDBM50098480
Synonyms:4-(4-Bromo-phenylsulfanyl)-thieno[2,3-c]pyridine-2-carboxylic acid amide | CHEMBL266198
TypeSmall organic molecule
Emp. Form.C14H9BrN2OS2
Mol. Mass.365.268
SMILESNC(=O)c1cc2c(Sc3ccc(Br)cc3)cncc2s1