Reaction Details
TargetPeroxisome proliferator-activated receptor alpha
LigandBDBM50099494
Substrate/Competitorn/a
Meas. Tech.ChEBML_153391
EC50 1±n/a nM
Citation Brown, PJStuart, LWHurley, KPLewis, MCWinegar, DAWilson, JGWilkison, WOIttoop, ORWillson, TM Identification of a subtype selective human PPARalpha agonist through parallel-array synthesis. Bioorg Med Chem Lett11:1225-7 (2001) Peroxisome proliferator-activated receptor alpha
Name:Peroxisome proliferator-activated receptor alpha
Type:Enzyme
Mol. Mass.:52222.08
Organism:Homo sapiens (Human)
Description:Q07869
Residue:468
BDBM50099494
NameBDBM50099494
Synonyms:2-(4-{2-[1-(4-Cyclohexyl-butyl)-3-(3,5-dichloro-phenyl)-ureido]-ethyl}-phenylsulfanyl)-2-methyl-propionic acid | CHEMBL21706
TypeSmall organic molecule
Emp. Form.C29H38Cl2N2O3S
Mol. Mass.565.595
SMILESCC(C)(Sc1ccc(CCN(CCCCC2CCCCC2)C(=O)Nc2cc(Cl)cc(Cl)c2)cc1)C(O)=O