Reaction Details
TargetReceptor tyrosine-protein kinase erbB-2
LigandBDBM50099969
Substrate/Competitorn/a
Meas. Tech.ChEMBL_194950 (CHEMBL795906)
IC50 10±n/a nM
Citation Cockerill, SStubberfield, CStables, JCarter, MGuntrip, SSmith, KMcKeown, SShaw, RTopley, PThomsen, LAffleck, KJowett, AHayes, DWillson, MWoollard, PSpalding, D Indazolylamino quinazolines and pyridopyrimidines as inhibitors of the EGFr and C-erbB-2. Bioorg Med Chem Lett11:1401-5 (2001) Receptor tyrosine-protein kinase erbB-2
Name:Receptor tyrosine-protein kinase erbB-2
Type:PROTEIN
Mol. Mass.:138816.81
Organism:Rattus norvegicus
Description:ChEMBL_42235
Residue:1257
BDBM50099969
NameBDBM50099969
Synonyms:(2-Benzyl-1H-benzoimidazol-5-yl)-(6,7-dimethoxy-quinazolin-4-yl)-amine | CHEMBL31407
TypeSmall organic molecule
Emp. Form.C24H21N5O2
Mol. Mass.411.4558
SMILESCOc1cc2ncnc(Nc3ccc4nc(Cc5ccccc5)[nH]c4c3)c2cc1OC