Reaction Details
TargetReceptor tyrosine-protein kinase erbB-2
LigandBDBM50099968
Substrate/Competitorn/a
Meas. Tech.ChEMBL_194950 (CHEMBL795906)
IC50 49±n/a nM
Citation Cockerill, SStubberfield, CStables, JCarter, MGuntrip, SSmith, KMcKeown, SShaw, RTopley, PThomsen, LAffleck, KJowett, AHayes, DWillson, MWoollard, PSpalding, D Indazolylamino quinazolines and pyridopyrimidines as inhibitors of the EGFr and C-erbB-2. Bioorg Med Chem Lett11:1401-5 (2001) Receptor tyrosine-protein kinase erbB-2
Name:Receptor tyrosine-protein kinase erbB-2
Type:PROTEIN
Mol. Mass.:138816.81
Organism:Rattus norvegicus
Description:ChEMBL_42235
Residue:1257
BDBM50099968
NameBDBM50099968
Synonyms:CHEMBL31653 | N*4*-(2-Benzyl-1H-benzoimidazol-5-yl)-pyrido[3,4-d]pyrimidine-4,6-diamine
TypeSmall organic molecule
Emp. Form.C21H17N7
Mol. Mass.367.4066
SMILESNc1cc2c(Nc3ccc4nc(Cc5ccccc5)[nH]c4c3)ncnc2cn1