Reaction Details
TargetReceptor tyrosine-protein kinase erbB-2
LigandBDBM50099966
Substrate/Competitorn/a
Meas. Tech.ChEMBL_194950 (CHEMBL795906)
IC50 27±n/a nM
Citation Cockerill, SStubberfield, CStables, JCarter, MGuntrip, SSmith, KMcKeown, SShaw, RTopley, PThomsen, LAffleck, KJowett, AHayes, DWillson, MWoollard, PSpalding, D Indazolylamino quinazolines and pyridopyrimidines as inhibitors of the EGFr and C-erbB-2. Bioorg Med Chem Lett11:1401-5 (2001) Receptor tyrosine-protein kinase erbB-2
Name:Receptor tyrosine-protein kinase erbB-2
Type:PROTEIN
Mol. Mass.:138816.81
Organism:Rattus norvegicus
Description:ChEMBL_42235
Residue:1257
BDBM50099966
NameBDBM50099966
Synonyms:CHEMBL281006 | N*4*-(1-Benzyl-1H-indazol-5-yl)-pyrido[3,4-d]pyrimidine-4,6-diamine
TypeSmall organic molecule
Emp. Form.C21H17N7
Mol. Mass.367.4066
SMILESNc1cc2c(Nc3ccc4n(Cc5ccccc5)ncc4c3)ncnc2cn1