Reaction Details
TargetRecQ-like DNA helicase BLM
LigandBDBM50544265
Substrate/Competitorn/a
Meas. Tech.ChEMBL_1992196 (CHEMBL4625931)
IC50 3300±n/a nM
Citation Wang, CXZhang, ZLYin, QKTu, JLWang, JEXu, YHRao, YOu, TMHuang, SLLi, DWang, HGLi, QJTan, JHChen, SBHuang, ZS Design, Synthesis, and Evaluation of New Quinazolinone Derivatives that Inhibit Bloom Syndrome Protein (BLM) Helicase, Trigger DNA Damage at the Telomere Region, and Synergize with PARP Inhibitors. J Med Chem63:9752-9772 (2020) 
 
RecQ-like DNA helicase BLM
Name:RecQ-like DNA helicase BLM
Type:PROTEIN
Mol. Mass.:159016.30
Organism:Homo sapiens (Human)
Description:ChEMBL_103670
Residue:1417
BDBM50544265
NameBDBM50544265
Synonyms:CHEMBL4634966
TypeSmall organic molecule
Emp. Form.C27H33FN4O
Mol. Mass.448.5755
SMILESCCCc1ccc(\C=C2/CCn3c2nc2cc(NCCN(CC)CC)c(F)cc2c3=O)cc1