Reaction Details
TargetRecQ-like DNA helicase BLM
LigandBDBM50544268
Substrate/Competitorn/a
Meas. Tech.ChEMBL_1992196 (CHEMBL4625931)
IC50 4000±n/a nM
Citation Wang, CXZhang, ZLYin, QKTu, JLWang, JEXu, YHRao, YOu, TMHuang, SLLi, DWang, HGLi, QJTan, JHChen, SBHuang, ZS Design, Synthesis, and Evaluation of New Quinazolinone Derivatives that Inhibit Bloom Syndrome Protein (BLM) Helicase, Trigger DNA Damage at the Telomere Region, and Synergize with PARP Inhibitors. J Med Chem63:9752-9772 (2020) 
 
RecQ-like DNA helicase BLM
Name:RecQ-like DNA helicase BLM
Type:PROTEIN
Mol. Mass.:159016.30
Organism:Homo sapiens (Human)
Description:ChEMBL_103670
Residue:1417
BDBM50544268
NameBDBM50544268
Synonyms:CHEMBL4637736
TypeSmall organic molecule
Emp. Form.C27H33FN4O2
Mol. Mass.464.5749
SMILESCCN(CC)CCNc1cc2nc3\C(CCn3c(=O)c2cc1F)=C\c1ccc(cc1O)C(C)C