Reaction Details
TargetRecQ-like DNA helicase BLM
LigandBDBM50544289
Substrate/Competitorn/a
Meas. Tech.ChEMBL_1992196 (CHEMBL4625931)
IC50 2800±n/a nM
Citation Wang, CXZhang, ZLYin, QKTu, JLWang, JEXu, YHRao, YOu, TMHuang, SLLi, DWang, HGLi, QJTan, JHChen, SBHuang, ZS Design, Synthesis, and Evaluation of New Quinazolinone Derivatives that Inhibit Bloom Syndrome Protein (BLM) Helicase, Trigger DNA Damage at the Telomere Region, and Synergize with PARP Inhibitors. J Med Chem63:9752-9772 (2020) 
 
RecQ-like DNA helicase BLM
Name:RecQ-like DNA helicase BLM
Type:PROTEIN
Mol. Mass.:159016.30
Organism:Homo sapiens (Human)
Description:ChEMBL_103670
Residue:1417
BDBM50544289
NameBDBM50544289
Synonyms:CHEMBL4647563
TypeSmall organic molecule
Emp. Form.C28H37FN4O
Mol. Mass.464.618
SMILESCCN(CC)CCCNc1cc2nc(\C=C\c3ccc(cc3)C(C)C)n(CC)c(=O)c2cc1F