Reaction Details
TargetMisshapen-like kinase 1
LigandBDBM50528194
Substrate/Competitorn/a
Meas. Tech.ChEMBL_1992461 (CHEMBL4626196)
IC50 336±n/a nM
Citation Smil, DWong, JFWilliams, EPAdamson, RJHowarth, AMcLeod, DAMamai, AKim, SWilson, BJKiyota, TAman, AOwen, JPoda, GHoriuchi, KYKuznetsova, EMa, HHamblin, JNCramp, SRoberts, OGEdwards, AMUehling, DAl-Awar, RBullock, ANO'Meara, JAIsaac, MB Leveraging an Open Science Drug Discovery Model to Develop CNS-Penetrant ALK2 Inhibitors for the Treatment of Diffuse Intrinsic Pontine Glioma. J Med Chem63:10061-10085 (2020) 
 
Misshapen-like kinase 1
Name:Misshapen-like kinase 1
Type:PROTEIN
Mol. Mass.:149838.92
Organism:Homo sapiens (Human)
Description:ChEMBL_793919
Residue:1332
BDBM50528194
NameBDBM50528194
Synonyms:CHEMBL4517408
TypeSmall organic molecule
Emp. Form.C25H29N3O3
Mol. Mass.419.5161
SMILESCOc1cc(cc(OC)c1OC)-c1cncc(c1C)-c1ccc(cc1)N1CCNCC1