Reaction Details
TargetCyclin-dependent kinase 1
LigandBDBM50105742
Substrate/Competitorn/a
Meas. Tech.ChEBML_216729
IC50>50±n/a nM
Citation Adams, JLBoehm, JCGallagher, TFKassis, SWebb, EFHall, RSorenson, MGarigipati, RGriswold, DELee, JC Pyrimidinylimidazole inhibitors of p38: cyclic N-1 imidazole substituents enhance p38 kinase inhibition and oral activity. Bioorg Med Chem Lett11:2867-70 (2001) Cyclin-dependent kinase 1
Name:Cyclin-dependent kinase 1
Type:Enzyme Subunit
Mol. Mass.:34101.08
Organism:Homo sapiens (Human)
Description:P06493
Residue:297
BDBM50105742
NameBDBM50105742
Synonyms:4-[4-(4-Fluoro-phenyl)-5-(2-methoxy-pyrimidin-4-yl)-imidazol-1-yl]-cyclohexanol trans -1-(4-hydroxycyclohexyl)-4-(4-fluorophenyl)-5-(2-methoxypyrimidin-4-yl)imidazole
TypeSmall organic molecule
Emp. Form.C20H21FN4O2
Mol. Mass.368.4047
SMILESCOc1nccc(n1)-c1c(ncn1[C@H]1CC[C@H](O)CC1)-c1ccc(F)cc1