Reaction Details
TargetMitogen-activated protein kinase 14
LigandBDBM50105748
Substrate/Competitorn/a
Meas. Tech.ChEBML_221157
IC50 1.4±n/a nM
Citation Adams, JLBoehm, JCGallagher, TFKassis, SWebb, EFHall, RSorenson, MGarigipati, RGriswold, DELee, JC Pyrimidinylimidazole inhibitors of p38: cyclic N-1 imidazole substituents enhance p38 kinase inhibition and oral activity. Bioorg Med Chem Lett11:2867-70 (2001) Mitogen-activated protein kinase 14
Name:Mitogen-activated protein kinase 14
Type:Serine/threonine-protein kinase
Mol. Mass.:41286.76
Organism:Homo sapiens (Human)
Description:Q16539
Residue:360
BDBM50105748
NameBDBM50105748
Synonyms:4-(4-(4-fluorophenyl)-1-(piperidin-4-yl)-1H-imidazol-5-yl)-N-phenylpyrimidin-2-amine D3RKN_80 | {4-[5-(4-Fluoro-phenyl)-3-piperidin-4-yl-3H-imidazol-4-yl]-pyrimidin-2-yl}-phenyl-amine
TypeSmall organic molecule
Emp. Form.C24H23FN6
Mol. Mass.414.478
SMILESFc1ccc(cc1)-c1ncn(C2CCNCC2)c1-c1ccnc(Nc2ccccc2)n1