Reaction Details
TargetTissue-type plasminogen activator
LigandBDBM50106240
Substrate/Competitorn/a
Meas. Tech.ChEMBL_222779 (CHEMBL847108)
Ki 110±n/a nM
Citation Mackman, RLKatz, BABreitenbucher, JGHui, HCVerner, ELuong, CLiu, LSprengeler, PA Exploiting subsite S1 of trypsin-like serine proteases for selectivity: potent and selective inhibitors of urokinase-type plasminogen activator. J Med Chem44:3856-71 (2001) Tissue-type plasminogen activator
Name:Tissue-type plasminogen activator
Type:Enzyme
Mol. Mass.:62931.08
Organism:Homo sapiens (Human)
Description:n/a
Residue:562
BDBM50106240
NameBDBM50106240
Synonyms:6-Chloro-2-(2-hydroxy-biphenyl-3-yl)-1H-indole-5-carboxamidine | CHEMBL339902
TypeSmall organic molecule
Emp. Form.C21H16ClN3O
Mol. Mass.361.824
SMILESNC(=N)c1cc2cc([nH]c2cc1Cl)-c1cccc(-c2ccccc2)c1O