Reaction Details
TargetGlutamate carboxypeptidase 2
LigandBDBM17659
Substrate/Competitorn/a
Meas. Tech.ChEMBL_141138 (CHEMBL749038)
IC50 0.3±n/a nM
Citation Jackson, PFTays, KLMaclin, KMKo, YSLi, WVitharana, DTsukamoto, TStoermer, DLu, XCWozniak, KSlusher, BS Design and pharmacological activity of phosphinic acid based NAALADase inhibitors. J Med Chem44:4170-5 (2001) Glutamate carboxypeptidase 2
Name:Glutamate carboxypeptidase 2
Type:PROTEIN
Mol. Mass.:84547.28
Organism:Rattus norvegicus
Description:ChEMBL_68365
Residue:752
BDBM17659
NameBDBM17659
Synonyms:(R,S)-2-phosphonomethylpentanedioic acid 2-PMPA US10894807, ID P009 | pentanedioic acid analogue, (RS)-1
TypeSmall organic molecule
Emp. Form.C6H11O7P
Mol. Mass.226.1211
SMILESOC(=O)CCC(CP(O)(O)=O)C(O)=O