Reaction Details
TargetBeta-3 adrenergic receptor
LigandBDBM50106828
Substrate/Competitorn/a
Meas. Tech.ChEBML_39053
Ki 85±n/a nM
Citation Gavai, AVSher, PMMikkilineni, ABPoss, KMMcCann, PJGirotra, RNFisher, LGWu, GBednarz, MSMathur, AWang, TCSun, CQSlusarchyk, DASkwish, SAllen, GTHillyer, DEFrohlich, BHAbboa-Offei, BECap, MWaldron, TLGeorge, RJTesfamariam, BHarper, TWCiosek, CPYoung, DADickinson, KESeymour, AAArbeeny, CMWashburn, WN BMS-196085: a potent and selective full agonist of the human beta(3) adrenergic receptor. Bioorg Med Chem Lett11:3041-4 (2001) Beta-3 adrenergic receptor
Name:Beta-3 adrenergic receptor
Type:G Protein-Coupled Receptor (GPCR)
Mol. Mass.:43534.88
Organism:Homo sapiens (Human)
Description:n/a
Residue:408
BDBM50106828
NameBDBM50106828
Synonyms:4-{(R)-1-[(R)-2-Hydroxy-2-(4-hydroxy-3-methanesulfonylamino-phenyl)-ethylamino]-2-phenyl-ethyl}-benzoic acid methyl ester | CHEMBL105004
TypeSmall organic molecule
Emp. Form.C25H28N2O6S
Mol. Mass.484.565
SMILESCOC(=O)c1ccc(cc1)[C@@H](Cc1ccccc1)NC[C@H](O)c1ccc(O)c(NS(C)(=O)=O)c1