Reaction Details
TargetPeroxisome proliferator-activated receptor gamma
LigandBDBM50049240
Substrate/Competitorn/a
Meas. Tech.ChEMBL_154353 (CHEMBL759115)
Ki 630±n/a nM
Citation Liu, KGLambert, MHAyscue, AHHenke, BRLeesnitzer, LMOliver, WRPlunket, KDXu, HESternbach, DDWillson, TM Synthesis and biological activity of L-tyrosine-based PPARgamma agonists with reduced molecular weight. Bioorg Med Chem Lett11:3111-3 (2001) Peroxisome proliferator-activated receptor gamma
Name:Peroxisome proliferator-activated receptor gamma
Type:Nuclear Receptor
Mol. Mass.:57613.46
Organism:Homo sapiens (Human)
Description:P37231
Residue:505
BDBM50049240
NameBDBM50049240
Synonyms:(+-)-5-((4-(2-(5-ethyl-2-pyridinyl)ethoxy)phenyl)methyl)-2,4-thiazolidinedione CHEMBL595 PIOGLITAZONE HYDROCHLORIDE
TypeSmall organic molecule
Emp. Form.C19H20N2O3S
Mol. Mass.356.439
SMILESCCc1ccc(CCOc2ccc(Cc3sc(=O)[nH]c3O)cc2)nc1