Reaction Details
TargetPeroxisome proliferator-activated receptor delta
LigandBDBM34017
Substrate/Competitorn/a
Meas. Tech.ChEMBL_154030 (CHEMBL759300)
Ki 2500±n/a nM
Citation Liu, KGLambert, MHAyscue, AHHenke, BRLeesnitzer, LMOliver, WRPlunket, KDXu, HESternbach, DDWillson, TM Synthesis and biological activity of L-tyrosine-based PPARgamma agonists with reduced molecular weight. Bioorg Med Chem Lett11:3111-3 (2001) Peroxisome proliferator-activated receptor delta
Name:Peroxisome proliferator-activated receptor delta
Type:Enzyme
Mol. Mass.:49910.45
Organism:Homo sapiens (Human)
Description:Q03181
Residue:441
BDBM34017
NameBDBM34017
Synonyms:CHEMBL104850 | phenylpropanoic acid derivative, 7
TypeSmall organic molecule
Emp. Form.C25H24N2O4
Mol. Mass.416.4691
SMILESCc1oc(nc1CCOc1ccc(C[C@@H](C(O)=O)n2cccc2)cc1)-c1ccccc1