Reaction Details
TargetPeroxisome proliferator-activated receptor gamma
LigandBDBM50085046
Substrate/Competitorn/a
Meas. Tech.ChEMBL_154353 (CHEMBL759115)
Ki 3.7±n/a nM
Citation Liu, KGLambert, MHAyscue, AHHenke, BRLeesnitzer, LMOliver, WRPlunket, KDXu, HESternbach, DDWillson, TM Synthesis and biological activity of L-tyrosine-based PPARgamma agonists with reduced molecular weight. Bioorg Med Chem Lett11:3111-3 (2001) Peroxisome proliferator-activated receptor gamma
Name:Peroxisome proliferator-activated receptor gamma
Type:Nuclear Receptor
Mol. Mass.:57613.46
Organism:Homo sapiens (Human)
Description:P37231
Residue:505
BDBM50085046
NameBDBM50085046
Synonyms:2-((S)-1-carboxy-2-{4-[2-(5-methyl-2-phenyl-oxazol-4-yl)-ethoxy]-phenyl}-ethylamino)-benzoic acid methyl ester CHEMBL106666
TypeSmall organic molecule
Emp. Form.C29H28N2O6
Mol. Mass.500.5424
SMILESCOC(=O)c1ccccc1N[C@@H](Cc1ccc(OCCc2nc(oc2C)-c2ccccc2)cc1)C(O)=O